{"text_format":"1","workbook":"xlsx","n_sheets":14,"sheets":["Instructions","Report Flowchart","Setup","CSA Cost Worksheet","CSA Budget Worksheet","Contract & Consultant Worksheet","Subawards Worksheet","Indirect Cost Rate Worksheet","MTDC","Program Expenditures Worksheet","Accounting Notes Worksheet","Certificate of Costs","State","CSAType"],"not_rendered":{"charts":0,"images":10,"macros":1,"external_links":1,"defined_names":58,"comments":0,"pivot_tables":0},"unopened":[],"bounds":{"document_bytes":16777216,"sheet_cells":100000,"rows_first":2000,"rows_last":500,"rows_between":2000,"halvings":0,"cell_chars":16384,"cell_head_chars":4096},"cells_cut":0,"cells_raw":0,"read":"whole","date_system":"1900"}

{"sheet":"Instructions","index":0,"n_rows":25,"n_cols":3,"rows_kept":25,"cut":false,"hidden":false,"merged":[]}
[]
[null,"NSF Major Facility Financial Data Collection Tool"]
[null,"Instructions"]
[]
[null,null,"OVERVIEW"]
[null,null,"This NSF Major Facility Financial Data Collection Tool was designed by the National Science Foundation (NSF) to assist recipients in submitting substantiated program expenditures for construction and operations and management costs for its Major facility cooperative agreements (CAs) and cooperative support agreements (CSAs) over $70 million and may be comprised of several different CSAs funded by multiple appropriations. This user-friendly reporting tool is comprised of several worksheets that enable recipients to submit adequate incurred program expenditures in accordance with NSF terms and conditions and the Major Facilities Guide. This reporting tool was instituted to ensure that funds for Major facilities are properly expended and managed.  The tool has color coded cells which will assist the user.  Yellow cells are manually filled in by the user, Blue cells are linked from other worksheets and Gray cells are auto calculated. This data tool is to be completed annually for incurred costs, using the accrual basis of accounting, for the applicable funding (project) year. The recipient must submit it to the cognizant Grants and Agreements Officer 120 days after the end of the funding year.  For example, if your agreement's period of performance runs from October 1, through September 30, you will submit this completed Data Collection Tool to your NSF Grants and Agreements Officer by January 31, each year for the 12-month funding year ended September 30.  This financial data is not required to tie to any other report submitted to NSF, prior to submission."]
[null,null,"WORKSHEET PREPARATION"]
[null,null,"Prior to completing the worksheets, retrieve a breakdown of federal funding (budget) for each cooperative agreement (CA) and for each cooperative support agreement (CSA), and a breakdown of all expenditures claimed for each CA and CSA. Suggested sources for this data include your Chart of Accounts, General Ledger, Job Cost Ledger, CA and CSA award budgets, contracts/vendors, consultants and subawards information, and your negotiated indirect cost rate agreement (NICRA). Please do not change the names of any existing worksheets or delete columns or rows on existing worksheets. In addition, the following guidance is provided for completing each tab of this worksheet."]
[null,null,"Setup: Complete this tab first as it will customize this reporting tool for your award. Ensure the macros are enabled before you complete the information on this tab, by clicking the “Enable Content” button. Input your institution and award data as requested.  Your award data should agree with the information listed in your CA and subsequent CSA(s).  Once you have entered all the required information including the number of CSAs in the Award Data box and select \"RUN SETUP\" you will start to enter information into each of the tabs starting with the CSA Cost Worksheet and then the CSA Budget Worksheet and then the Contract/Consultant Worksheet, etc.  Go in order of the worksheets from left to right.  If you need to add additional CSAs after \"RUN SETUP\" has run, use the \"Add New CSA\" Button on the CSA Cost Worksheet Tab. This button will allow you to add a new CSA table throughout the Tool. If this functionality is used please update the number of CSAs on the Setup Tab to match what is on the CSA Cost Worksheet."]
[null,null,"Cooperative Support Agreement Cost Worksheet: The purpose of the CSA Cost Worksheet is to reconcile costs from the Job Cost Ledger for all award CSAs. A separate CSA table will be added to the CSA cost worksheet based on the number of CSAs entered in the Setup tab once you hit \"Run Setup\".  If you need to add additional CSAs after \"RUN SETUP\" has run, use the \"Add New CSA\" Button on the CSA Cost Worksheet Tab. Input your current year expenditures from your Job Cost Ledger and any adjustments in each of the cost categories. Add any additional comments, which can provide clarity or explanation to the reviewer on costs.  *Fee must be included in the last row and a note added in the tab Accounting Notes Worksheet. **For purposes of reporting “Claimed Direct Costs,” costs incurred using “contingency funds” should be reported within the cost category into which they would naturally fall. ***Program Income should not be included in your costs but provided on the Program Income Reporting Worksheet per the \"Proposal and Awards Policies and Procedures Guide\".\n\n\n"]
[null,null,"Cooperative Support Agreement Budget Worksheet: The CSA Budget Worksheet captures the reported costs for each of the major cost elements for each CSA (for the funding year and cumulatively from the start of the CSA's period of performance to the end of the funding year).  These costs are compared to approved budgets for each CSA to indicate the amount remaining for each budget category.  Input your approved NSF budget for the funding year and cumulative (from the start of the CSA's period of performance to the end of the funding year) in each of the cost categories and your cumulative expenditures.  *Fee must be included in the last row and a note added in the tab Accounting Notes Worksheet. **Contingency Funds must be included in the “Other Direct Costs: Other” row and a note added below.  (See Major Facilities Guide, Section 4.2.2.4, “Application of 2 CFR § 200 Cost Principles to NSF Budget Categories from the PAPPG”.)  ***However, for purposes of reporting in the \"Current Expenditures” columns, expenditures made using “contingency funds” should be reported within the cost category into which they would naturally fall.  ****Program Income should not be included in your costs but provided on the Program Income Reporting Worksheet per the \"Proposal and Awards Policies and Procedures Guide\".\n"]
[null,null,"Contract & Consultant Worksheet: The Contract and Consultant Worksheet provides details of costs for each contract/consultant identified by the recipient.  A contract or consultant is for the purpose of obtaining goods and services and creates a procurement relationship with the contractor.  All Contract and consultant agreements with contract amounts > $25,000 must be broken out individually on the  worksheet. Contract and consultant agreements under $25,000 may be accumulated into one row and submitted with a separate spreadsheet/accounting system report listing the cumulated agreements and amounts.  The Worksheet provides for 100 agreements, but more rows may be added, if necessary.  Make sure you enter the contract type (e.g. cost-reimbursement, T&M, labor-hour, firm fixed-price).  Add any other important information in the Recipient Preparation Notes."]
[null,null,"Subawards Worksheet: The Subawards Worksheet provides detail of costs for each subaward.  A Subaward means an award provided by a pass-through entity to a subrecipient for the subrecipient to carry out part of the scope under a Federal award.  It does not include payments to a contractor or payments to an individual that is a beneficiary of a Federal program.  A subaward may be provided through any form of legal agreement, including an agreement that the pass-through entity considers a contract.  All Subawards with award amounts > $25,000 must be broken out individually on the Subawards worksheet. Subawards under $25,000 may be accumulated into one row and submitted with a separate spreadsheet/accounting system report listing the cumulated subawards and amounts.  The Worksheet provides for 100 agreements, but more rows may be added, if necessary.  Make sure you enter the subaward type (e.g. cost-reimbursement or fixed amount). Add other important information in \"Recipient Preparation Notes\".  \n\n\n"]
[null,null,"Indirect Cost Rate Worksheet: The purpose of the Indirect Cost Rate Worksheet is to capture details associated with the indirect cost rates.  The schedule of indirect cost includes the period of performance start and end dates, the base amount, and rate applied for each identified rate type such as Facilities & Administrative, General & Administrative, or other specified. If using Modified Total Direct Cost (MTDC) as your allocation base, click the checkbox. "]
[null,null,"Program Expenditures Worksheet: The purpose of the Program Expenditures Worksheet is to capture a summary of award expenditures as consolidated from the recipient’s General Ledger/Trial Balance. This summary also shows a summary of expenditures as compared to the approved budget for the entire CA.  <Program expenditures worksheet> is linked to <CSA cost worksheet> and <CSA budget worksheet>.This information is automatically calculated from amounts entered in the CSA cost worksheet and CSA budget worksheet."]
{"$rows_left_out":11}
{"sheet":"Report Flowchart","index":1,"n_rows":5,"n_cols":3,"rows_kept":5,"cut":false,"hidden":false,"merged":[]}
[]
[null,null,{"$f":"Instructions!B2","v":"NSF Major Facility Financial Data Collection Tool"}]
[null,null,"Flowchart"]
[]
[null,"    ","This process diagram indicates the steps to complete the data collection tool. It identifies the core data sources recipients should utilize to complete the worksheets to accurately capture the data. Progressing through the tool's worksheets from left to right will streamline the data capture and submission process."]

{"sheet":"Setup","index":2,"n_rows":50,"n_cols":7,"rows_kept":50,"cut":false,"hidden":false,"merged":[]}
[]
[null,{"$f":"Instructions!B2","v":"NSF Major Facility Financial Data Collection Tool"}]
[null,"Setup"]
[]
[]
["    "]
[null,null,"INSTITUTION DATA"]
[null,null,"Recipient Name:"]
[null,null,"City:"]
[null,null,"State:"]
[null,null,"Zip Code:"]
[null,null,"Country:"]
[null,null,"Website:"]
[null,null,"AWARD DATA"]
[null,null,"CA Award Number:"]
{"$rows_left_out":36}
{"sheet":"CSA Cost Worksheet","index":3,"n_rows":36,"n_cols":13,"rows_kept":36,"cut":false,"hidden":false,"merged":[]}
[]
[null,{"$f":"Instructions!B2","v":"NSF Major Facility Financial Data Collection Tool"}]
[null,"Cooperative Support Agreement Cost Worksheet",null,null,null,null,null,null,null,null,null,"New CSA number entered",0]
[null,"Recipient Preparation Notes",null,null,null,"Yellow Cells:","Manual fill by user"]
["    ",null,null,null,null,"Blue Cells:","Linked from other worksheets"]
[null,null,null,null,null,"Gray Cells:","Auto-calculated"]
[null,null,null,null,null,"Recipient Name ",{"$f":"Setup!D8","v":0},null,"Funding Year Start\n",{"$f":"Setup!D23","v":"Enter the first day of the funding (project) year being reported in a MM/DD/YYYY format."}]
[null,null,null,null,null,"Name of Facility ",{"$f":"Setup!D17","v":0},null,"Funding Year End\n",{"$f":"Setup!D24","v":"Enter the last day of the funding (project) year being reported in a MM/DD/YYYY format."}]
[]
[]
[]
[null,null,"Select CSA Type"]
[null,null,"Enter CSA #","Job Cost Ledger","Accrual Adjustments","Current Expenditures","Comment"]
[null,null,"Claimed Direct Costs\nby Budget Category"]
[null,null,"Senior Personnel",0,0,{"$f":"D15+E15","v":0}]
{"$rows_left_out":22}
{"sheet":"CSA Budget Worksheet","index":4,"n_rows":36,"n_cols":17,"rows_kept":36,"cut":false,"hidden":false,"merged":[]}
[]
[null,{"$f":"Instructions!B2","v":"NSF Major Facility Financial Data Collection Tool"}]
[null,"Cooperative Support Agreement Budget Worksheet"]
[null,"Recipient Preparation Notes",null,null,null,"Yellow Cells:","Manual fill by user"]
["    ",null,null,null,null,"Blue Cells:","Linked from other worksheets",null,null,null,null,null,null,null,null,null,"New CSA number entered"]
[null,null,null,null,null,"Gray Cells:","Auto-calculated"]
[null,null,null,null,null,"Recipient Name ",{"$f":"Setup!D8","v":0},null,"Funding Year Start\n",{"$f":"Setup!D23","v":"Enter the first day of the funding (project) year being reported in a MM/DD/YYYY format."}]
[null,null,null,null,null,"Name of Facility",{"$f":"Setup!D17","v":0},null,"Funding Year End\n",{"$f":"Setup!D24","v":"Enter the last day of the funding (project) year being reported in a MM/DD/YYYY format."}]
[]
[]
[null,null,null,null,null,"Summary of CSA Expenditures"]
[null,null,null,null,null,"For funding year",null,null,null,null,null,"Inception to date (CSA Period of Performance Start to Funding Year End)"]
[null,null,"Select CSA Type","NSF Approved Budget         ","Current Expenditures","Unliquidated Obligations","Total","Unobligated balance",null,"NSF Approved Budget         ","Current Expenditures","Unliquidated Obligations","Total","Unobligated balance"]
[null,null,"CSA Number"]
[null,null,"Senior Personnel",0,0,0,{"$f":"E15+F15","v":0},{"$f":"D15-G15","v":0},null,0,0,0,{"$f":"K15+L15","v":0},{"$f":"J15-M15","v":0}]
{"$rows_left_out":22}
{"sheet":"Contract & Consultant Worksheet","index":5,"n_rows":112,"n_cols":25,"rows_kept":112,"cut":false,"hidden":false,"merged":[]}
[]
[null,{"$f":"Instructions!B2","v":"NSF Major Facility Financial Data Collection Tool"}]
[null,"Contract & Consultant Worksheet",null,null,null,null,null,null,null,null,null,null,null,null,null,null,null,null,null,null,null,null,null,null,"Fixed"]
[null,null,null,null,null,null,null,null,null,null,null,null,null,null,null,null,null,null,null,null,null,null,null,null,"Performance Based"]
["    ","Recipient Preparation Notes",null,null,null,null,null,"Yellow Cells:","Manual fill by user",null,null,null,null,null,null,null,null,null,null,null,null,null,null,null,"Cost Reimbursable"]
[null,null,null,null,null,null,null,"Blue Cells:","Linked from other worksheets",null,null,null,null,null,null,null,null,null,null,null,null,null,null,null,"T&M"]
[null,null,null,null,null,null,null,"Gray Cells:","Auto-calculated"]
[null,null,null,null,null,null,null,"Recipient Name ",{"$f":"Setup!D8","v":0},null,"Funding Year Start\n",{"$f":"Setup!D23","v":"Enter the first day of the funding (project) year being reported in a MM/DD/YYYY format."}]
[null,null,null,null,null,null,null,"Name of Facility",{"$f":"Setup!D17","v":0},null,"Funding Year End\n",{"$f":"Setup!D24","v":"Enter the last day of the funding (project) year being reported in a MM/DD/YYYY format."}]
[]
[]
[null,null,"Contract Information","CSA Cost category","CSA Award Number","Contract #","DUNS number","Contractor Name","City","State","Zip Code","Country","Contract Amount","Cumulative Expenditures to Date","Expenditures During Funding  Year","Signed Date of Contract","Contract Type","Period of Performance Start","Period of Performance End","Brief Statement of Work"]
[null,null,"Contract #1"]
[null,null,"Contract #2"]
[null,null,"Contract #3"]
{"$rows_left_out":98}
{"sheet":"Subawards Worksheet","index":6,"n_rows":110,"n_cols":19,"rows_kept":110,"cut":false,"hidden":false,"merged":[]}
[]
[null,{"$f":"Instructions!B2","v":"NSF Major Facility Financial Data Collection Tool"}]
[null,"Subawards Worksheet"]
[null,"Recipient Preparation Notes",null,null,null,null,"Yellow Cells:","Manual fill by user"]
["    ",null,null,null,null,null,"Blue Cells:","Linked from other worksheets"]
[null,null,null,null,null,null,"Gray Cells:","Auto-calculated"]
[null,null,null,null,null,null,"Recipient Name ",{"$f":"Setup!D8","v":0},null,"Funding Year Start\n",{"$f":"Setup!D23","v":"Enter the first day of the funding (project) year being reported in a MM/DD/YYYY format."}]
[null,null,null,null,null,null,"Name of Facility ",{"$f":"Setup!D17","v":0},null,"Funding Year End\n",{"$f":"Setup!D24","v":"Enter the last day of the funding (project) year being reported in a MM/DD/YYYY format."}]
[]
[null,null,"Subaward Information","CSA Award Number","Subaward #","DUNS number","Subrecipient Name","City","State","Zip Code","Country","Subaward Amount","Cumulative Expenditures to Date","Expenditures During Funding  Year","Date of Award","Award type","Period of Performance Start","Period of Performance End","Brief Statement of Work"]
[null,null,"Subaward #1"]
[null,null,"Subaward #2"]
[null,null,"Subaward #3"]
[null,null,"Subaward #4"]
[null,null,"Subaward #5"]
{"$rows_left_out":96}
{"sheet":"Indirect Cost Rate Worksheet","index":7,"n_rows":17,"n_cols":12,"rows_kept":17,"cut":false,"hidden":false,"merged":[]}
[]
[null,{"$f":"Instructions!B2","v":"NSF Major Facility Financial Data Collection Tool"}]
[null,"Indirect Cost Rate Worksheet"]
[]
["    ","Recipient Preparation Notes",null,null,null,null,null,"Yellow Cells:","Manual fill by user"]
[null,null,null,null,null,null,null,"Blue Cells:","Linked from other worksheets"]
[null,null,null,null,null,null,null,"Gray Cells:","Auto-calculated"]
[null,null,null,null,null,null,null,"Recipient Name ",{"$f":"Setup!D8","v":0},null,"Funding Year Start\n",{"$f":"Setup!D23","v":"Enter the first day of the funding (project) year being reported in a MM/DD/YYYY format."}]
[null,null,null,null,null,null,null,"Name of Facility ",{"$f":"Setup!D17","v":0},null,"Funding Year End\n",{"$f":"Setup!D24","v":"Enter the last day of the funding (project) year being reported in a MM/DD/YYYY format."}]
[]
[null,null,null,null,null,"Schedule of Indirect Costs"]
[]
[null,null,null,"Period of ","Period of ",null,null,null,null,"   "]
[null,null,"Description","Performance Start Date","Performance End Date","Allocation Base","$ Amount Base","Rate Applied","Total Expended","Comments"]
[null,null,"Facilities & Administrative",null,null,null,0,null,{"$f":"G15*H15","v":0}]
{"$rows_left_out":3}
{"sheet":"MTDC","index":8,"n_rows":15,"n_cols":12,"rows_kept":15,"cut":false,"hidden":true,"merged":[[5,1,8,5],[12,9,13,9],[12,10,13,10],[10,3,10,10],[11,1,11,2],[12,1,12,2],[12,3,13,3],[12,4,13,4],[12,5,13,5],[12,6,13,6],[12,7,13,7],[12,8,13,8],[7,8,7,9],[8,8,8,9]]}
[]
[null,{"$f":"Instructions!B2","v":"NSF Major Facility Financial Data Collection Tool"}]
[null,"Modified Total Direct Cost Recalculation Worksheet"]
[]
["    ","Recipient Preparation Notes",null,null,null,null,null,"Yellow Cells:","Manual fill by user"]
[null,"Please enter any notes or comments regarding your calculations or data submitted for this worksheet.",null,null,null,null,null,"Blue Cells:","Linked from other worksheets"]
[null,null,null,null,null,null,null,"Gray Cells:","Auto-calculated"]
[null,null,null,null,null,null,null,"Recipient Name ",{"$f":"Setup!D8","v":0},null,"Funding Year Start\n",{"$f":"Setup!D23","v":"Enter the first day of the funding (project) year being reported in a MM/DD/YYYY format."}]
[null,null,null,null,null,null,null,"Name of Facility ",{"$f":"Setup!D17","v":0},null,"Funding Year End\n",{"$f":"Setup!D24","v":"Enter the last day of the funding (project) year being reported in a MM/DD/YYYY format."}]
[]
[null,null,null,"Modified Total Direct Cost (MTDC)"]
[]
[null,null,null,"a. Total Direct Costs ","b. All subawards in excess of $25,000","c. All subcontracts in excess of $25,000","d. Capital expenditures>$5,000","e. In-kind contribution","f. Participant support costs","g. Other distorting costs","h.Total MTDC \n(a-b-c-d-e-f-g)"]
[null,null,"Description"]
[null,null,"CSA# 1",null,null,null,null,null,null,null,{"$f":"D15-E15-F15-G15-H15-I15-J15","v":0}]
{"$rows_left_out":1}
{"sheet":"Program Expenditures Worksheet","index":9,"n_rows":256,"n_cols":17,"rows_kept":256,"cut":false,"hidden":false,"merged":[]}
[]
[null,{"$f":"Instructions!B2","v":"NSF Major Facility Financial Data Collection Tool"},null,null,null,null,null,null,null,null,null,null,null,null,null,null,2]
[null,"Program Expenditures Worksheet",null,null,null,null,null,null,null,null,null,null,null,null,null,null,3]
[null,"Recipient Preparation Notes",null,null,null,null,null,"Yellow Cells:","Manual fill by user",null,null,null,null,null,null,null,4]
["    ",null,null,null,null,null,null,"Blue Cells:","Linked from other worksheets",null,null,null,null,null,null,null,5]
[null,null,null,null,null,null,null,"Gray Cells:","Auto-calculated",null,null,null,null,null,null,null,6]
[null,null,null,null,null,null,null,"Recipient Name ",{"$f":"Setup!D8","v":0},null,null,"Funding Year Start\n",{"$f":"Setup!D23","v":"Enter the first day of the funding (project) year being reported in a MM/DD/YYYY format."},null,null,null,7]
[null,null,null,null,null,null,null,"Name of Facility",{"$f":"Setup!D17","v":0},null,null,"Funding Year End\n",{"$f":"Setup!D24","v":"Enter the last day of the funding (project) year being reported in a MM/DD/YYYY format."},null,null,null,8]
[null,null,null,null,null,null,null,null,null,null,null,null,null,null,null,null,9]
[null,null,null,null,"Reconciliation of Books of Account for all CSAs",null,null,null,null,null,null,null,null,null,null,null,10]
[null,null,null,null,null,null,null,null,null,null,null,null,null,null,null,null,11]
[null,null,null,null,null,null,null,null,null,null,null,null,null,null,null,null,12]
[null,null,"Current Expenditures\nby Major Cost Element","Job Cost Ledger","Accrual Adjustments","Current Expenditures","Comments",null,null,null,null,null,null,null,null,null,13]
[null,null,"Senior Personnel",{"$f":"SUMIF('CSA Cost Worksheet'!$C$15:$C$500000,C14,'CSA Cost Worksheet'!$D$15:$D$500000)","v":0},{"$f":"SUMIF('CSA Cost Worksheet'!$C$15:$C$500000,C14,'CSA Cost Worksheet'!$E$15:$E$500000)","v":0},{"$f":"SUMIF('CSA Cost Worksheet'!$C$15:$C$500000,C14,'CSA Cost Worksheet'!$F$15:$F$500000)","v":0},null,null,null,null,null,null,null,null,null,null,14]
[null,null,"Other Personnel",{"$f":"SUMIF('CSA Cost Worksheet'!$C$15:$C$500000,C15,'CSA Cost Worksheet'!$D$15:$D$500000)","v":0},{"$f":"SUMIF('CSA Cost Worksheet'!$C$15:$C$500000,C15,'CSA Cost Worksheet'!$E$15:$E$500000)","v":0},{"$f":"SUMIF('CSA Cost Worksheet'!$C$15:$C$500000,C15,'CSA Cost Worksheet'!$F$15:$F$500000)","v":0},null,null,null,null,null,null,null,null,null,null,15]
{"$rows_left_out":242}
{"sheet":"Accounting Notes Worksheet","index":10,"n_rows":19,"n_cols":5,"rows_kept":19,"cut":false,"hidden":false,"merged":[]}
[]
[null,{"$f":"Instructions!B2","v":"NSF Major Facility Financial Data Collection Tool"}]
[null,"Accounting Notes Worksheet"]
[]
["    "]
[null,"The information in this section will be used to identify the awardee's accounting resources "]
[null,"utilized to consolidate program expenditures in this collection tool. Please select \"Y\" or \"N\" "]
[null,"in the column below to identify which accounting documents where referenced as "]
[null,"supporting documentation in your submission. If you select \"N,\" please explain your "]
[null,"response in further detail and/or submit additional documentation, as necessary, with this "]
[null,"tool. Use the \"Comment\" field to supply NSF with additional information regarding the "]
[null,"source or computation of data submitted."]
[null,"#","Checklist Item","Y/N","Comments/Notes"]
[null,1,"General Ledger"]
[null,2,"Job Cost Ledger"]
{"$rows_left_out":5}
{"sheet":"Certificate of Costs","index":11,"n_rows":20,"n_cols":7,"rows_kept":20,"cut":false,"hidden":false,"merged":[]}
[]
[null,{"$f":"Instructions!B2","v":"NSF Major Facility Financial Data Collection Tool"}]
[null,"Certificate of Costs",null,null,null,"Yellow Cells:","Manual fill by user"]
[null,null,null,null,null,"Blue Cells:","Linked from other report tabs"]
["    ","Recipient Name ",null,{"$f":"Setup!D8","v":0},null,"Gray Cells:","Auto-calculated"]
[null,"Name of Facility ",null,{"$f":"Setup!D17","v":0}]
[]
[]
[]
[]
[null,null,"Overview: Please complete this tab to certify that the information included in these worksheets"]
[null,null,"are based on your current accounting records and ledgers."]
[null,null,"Recipient Name:",{"$f":"Setup!D8","v":0}]
[null,null,"Current Expenditures:"]
[null,null,"Prepared By (Authorized Organizational Representative (AOR) Name):"]
{"$rows_left_out":6}
{"sheet":"State","index":12,"n_rows":58,"n_cols":1,"rows_kept":58,"cut":false,"hidden":true,"merged":[]}
["Alaska"]
["Alabama"]
["Arkansas"]
["Austria"]
["Arizona"]
["California"]
["Colorado"]
["Connecticut"]
["District of Columbia"]
["Delaware"]
["Florida"]
["France"]
["Georgia"]
["Hawaii"]
["Iowa"]
{"$rows_left_out":44}
{"sheet":"CSAType","index":13,"n_rows":3,"n_cols":1,"rows_kept":3,"cut":false,"hidden":true,"merged":[]}
["Construction"]
["Operations"]
["Other"]